{"text_format":"1","workbook":"xlsx","n_sheets":7,"sheets":["TitlePage","Meals","Mileage","Lodging","Misc.Expenses","Air&RentalCar","perdiem"],"not_rendered":{"charts":0,"images":0,"macros":1,"external_links":0,"defined_names":187,"comments":5,"pivot_tables":0},"unopened":[],"bounds":{"document_bytes":16777216,"sheet_cells":100000,"rows_first":2000,"rows_last":500,"rows_between":2000,"halvings":0,"cell_chars":16384,"cell_head_chars":4096},"cells_cut":0,"cells_raw":0,"read":"whole","date_system":"1900"}

{"sheet":"TitlePage","index":0,"n_rows":79,"n_cols":40,"rows_kept":79,"cut":false,"hidden":false,"merged":[[19,36,19,37],[20,36,20,37],[21,36,21,37],[22,36,22,37],[23,36,23,37],[24,36,24,37],[25,36,25,37],[26,36,26,37],[27,36,27,37],[37,36,37,37],[38,36,38,37],[39,36,39,37],[40,36,40,37],[41,36,41,37],[42,36,42,37],[37,31,37,34],[38,31,38,34],[39,31,39,34],[40,31,40,34],[41,31,41,34],[42,31,42,34],[30,36,30,37],[31,36,31,37],[32,36,32,37],[33,36,33,37],[34,36,34,37],[35,36,35,37],[36,36,36,37],[28,31,28,34],[29,31,29,34],[30,31,30,34],[31,31,31,34],[32,31,32,34],[33,31,33,34],[34,31,34,34],[35,31,35,34],[36,31,36,34],[28,36,28,37],[29,36,29,37],[19,31,19,34],[20,31,20,34],[21,31,21,34],[22,31,22,34],[23,31,23,34],[24,31,24,34],[25,31,25,34],[26,31,26,34],[27,31,27,34],[8,36,11,37],[0,0,19,0],[0,21,19,21],[40,18,40,19],[28,18,28,19],[21,18,21,19],[25,18,25,19],[10,6,10,12],[11,6,11,12],[27,4,27,7],[28,4,28,7],[38,4,38,7],[33,4,33,7],[34,4,34,7],[27,9,27,10],[28,9,28,10],[27,18,27,19],[35,18,35,19],[29,9,29,10],[29,18,29,19],[36,18,36,19],[38,18,38,19],[31,9,31,10],[30,9,30,10],[48,5,48,9],[48,10,48,16],[45,14,45,16],[47,10,47,16],[44,1,44,2],[43,4,43,7],[49,2,49,3],[32,18,32,19],[48,18,48,19],[47,18,47,19],[37,18,37,19],[33,9,33,10],[32,4,32,7],[47,5,47,9],[41,18,41,19],[42,18,42,19],[41,9,41,10],[32,9,32,10],[45,18,45,19],[48,2,48,4],[39,4,39,7],[43,1,43,2],[32,1,32,2],[45,9,45,10],[30,18,30,19],[26,9,26,10],[34,1,34,2],[33,1,33,2],[36,4,36,7],[42,9,42,10],[43,9,43,10],[6,18,6,19],[8,15,8,19],[34,18,34,19],[38,9,38,10],[34,9,34,10],[35,9,35,10],[36,9,36,10],[39,9,39,10],[40,9,40,10],[37,9,37,10],[14,16,14,18],[13,6,13,11],[37,4,37,7],[36,1,36,2],[35,1,35,2],[40,1,40,2],[15,16,15,18],[0,16,0,19],[1,16,1,19],[4,1,4,3],[0,6,0,11],[1,6,1,11],[0,1,0,4],[1,1,2,1],[1,2,2,3],[4,4,4,7],[3,15,4,15],[4,16,4,19],[4,10,4,12],[22,18,22,19],[5,5,5,12],[6,5,6,12],[7,5,7,12],[31,4,31,7],[35,4,35,7],[7,15,7,19],[10,16,10,19],[11,16,11,19],[8,5,8,12],[5,16,5,19],[24,4,24,7],[13,4,13,5],[13,14,13,15],[14,4,14,5],[15,4,15,5],[21,9,21,10],[22,9,22,10],[23,9,23,10],[24,9,24,10],[23,4,23,7],[22,4,22,7],[21,4,21,7],[14,14,14,15],[42,1,42,2],[15,14,15,15],[13,16,13,18],[30,4,30,7],[41,1,41,2],[14,6,14,11],[15,6,15,11],[21,0,43,0],[29,1,29,2],[29,4,29,7],[24,1,24,2],[39,1,39,2],[31,1,31,2],[30,1,30,2],[21,1,21,2],[22,1,22,2],[25,4,25,7],[27,1,27,2],[26,1,26,2],[23,1,23,2],[37,1,37,2],[38,1,38,2],[40,4,40,7],[41,4,41,7],[9,1,9,19],[17,4,17,19],[23,18,23,19],[26,4,26,7],[28,1,28,2],[49,5,49,9],[49,10,49,16],[49,18,49,19],[19,1,19,19],[25,1,25,2],[24,18,24,19],[20,18,20,19],[20,4,20,7],[20,1,20,2],[20,9,20,10],[31,18,31,19],[44,4,44,7],[44,9,44,10],[42,4,42,7],[20,14,20,16],[26,18,26,19],[25,9,25,10],[33,18,33,19],[43,18,43,19]]}
[{"$f":"IF(Sum_ALL=0,\"UNVERIFIED VOUCHER\",\"\")","v":"UNVERIFIED VOUCHER"},null,null,null,null,null,"University of Louisville",null,null,null,null,null,null,null,null,null,"Total Reimbursement",null,null,null,null,{"$f":"IF(Sum_ALL=0,\"UNVERIFIED VOUCHER\",\"\")","v":"UNVERIFIED VOUCHER"},false,{"$f":"NOW()-731","v":"2012-04-24T10:18:15.480"},"<-- MIN_DATE"]
[null,null,null,null,null,null,"Travel Expense Voucher",null,null,null,null,null,null,{"$f":"IF(W1,IF(W2,\"Select 1 Status\",\"EMPLOYEE\"),IF(W2,\"STUDENT\",\"Select 1 Status\"))","v":"Select 1 Status"},null,null,{"$f":"(M46)","v":0},null,null,null,null,null,false]
[]
[null,null,null,null,null,null,null,null,null,"Date ",null,null,null,null,null,"ID#",null,null,null,null,null,null,null,null,null,null,null,null,null,null,null,"Sheet","Column","Min","Max","Alert if >","Explanation"]
[null,"Vendor Number:",null,null,null,null,null,null,null,"Prepared:",null,null,null,null,null,null,null,null,null,null,null,null,null,null,null,null,null,null,null,null,null,"Mileage","G",1,2000,1000,"N/A"]
[null,"Employee/Student Name:",null,null,null,null,null,null,null,null,null,null,null,null,"Department:",null,null,null,null,null,null,null,null,null,null,null,null,null,null,null,null,"Lodging","F",1,10000,1000,"Optional"]
[null,"Workstation:",null,null,null,null,null,null,null,null,null,null,null,null,"Department Contact",null,null,null,null,null,null,null,null,null,null,null,null,null,null,null,null,"Misc.Expenses","H",1,10000,2000,"Required"]
[null,"Residence Address:",null,null,null,null,null,null,null,null,null,null,null,null,"Name:",null,null,null,null,null,null,null,null,null,null,null,null,null,null,null,null,"Air&RentalCar","G",1,25000,10000,"Optional"]
[null,"City/State/Zip Code:",null,null,null,null,null,null,null,null,null,null,null,null,"Phone:",null,null,null,null,null,null,null,null,null,null,null,null,null,null,null,null,null,null,null,null,null,"Modifying Yellow boxes above will not affect Macro logic"]
[null,{"$f":"IF(ISBLANK(TP_Return_Date),\"Travel Voucher Due to the Controller’s Office within 60 days of Return Date or 60 days from the day the expense occurred for mileage-only claims.\",\"Travel Voucher Due to the Controller's Office by \" & TEXT(TP_Return_Date+60,\"m/d/yyyy\")&\" or 60 days from the day the expense occurred for mileage-only claims.\")","v":"Travel Voucher Due to the Controller’s Office within 60 days of Return Date or 60 days from the day the expense occurred for mileage-only claims."}]
[null,null,"Dates",null,"Departure Date:",null,null,null,null,null,null,null,null,null,"Return Date:"]
[null,null,"of Travel:",null,"Departure Time:",null,null,null,null,null,null,null,null,null,"Return Time:"]
[]
[null,null,"Travel",null,"Travel From:    City",null,"Louisville",null,null,null,null,null,2,null,"Travel To:    City",null,null,null,null,1]
[null,null,"Destination:",null,"Travel From:    City",null,null,null,null,null,null,null,1,null,"Travel To:    City",null,null,null,null,1]
[null,null,null,null,"Travel From:    City",null,null,null,null,null,null,null,1,null,"Travel To:    City",null,null,null,null,1]
[]
[null,"Purpose of Travel:"]
[]
[null,"Complete pages 2 through 6 before entering information in this section. Shaded areas will automatically populate.",null,null,null,null,null,null,null,null,null,null,null,null,null,null,null,null,null,null,null,null,null,null,null,null,null,"State",null,null,null,{"$f":"IF(SUM('Air&RentalCar'!$G$19)=0,\"\",\"535110 In-state Air\")","v":""},null,null,null,null,{"$f":"'Air&RentalCar'!$G$19","v":0},null,null,{"$f":"$J20","v":0}]
{"$rows_left_out":60}
{"sheet":"Meals","index":1,"n_rows":516,"n_cols":26,"rows_kept":516,"cut":false,"hidden":false,"merged":[[11,13,11,14],[12,13,12,14],[44,5,44,6],[44,7,44,8],[12,10,12,11],[19,10,19,11],[20,10,20,11],[21,10,21,11],[22,10,22,11],[11,10,11,11],[21,13,21,14],[22,13,22,14],[32,13,32,14],[19,13,19,14],[16,13,16,14],[15,10,15,11],[0,0,0,14],[1,0,1,14],[9,6,9,8],[4,5,4,8],[4,9,4,12],[9,13,9,14],[8,10,8,11],[9,10,9,11],[5,11,5,13],[5,6,5,9],[6,6,6,9],[6,11,6,13],[28,0,28,4],[25,13,25,14],[26,13,26,14],[23,13,23,14],[24,10,24,11],[25,10,25,11],[23,10,23,11],[26,10,26,11],[28,13,28,14],[24,13,24,14],[20,13,20,14],[15,13,15,14],[13,13,13,14],[14,13,14,14],[17,10,17,11],[16,10,16,11],[13,10,13,11],[17,13,17,14],[18,10,18,11],[14,10,14,11],[53,13,53,14],[47,13,47,14],[48,13,48,14],[49,13,49,14],[50,13,50,14],[51,13,51,14],[51,2,52,2],[43,9,43,10],[44,9,44,10],[43,5,43,6],[43,7,43,8],[47,0,47,4],[47,5,47,6],[46,9,46,10],[46,0,46,1],[46,5,46,6],[45,5,45,6],[45,7,45,8],[45,9,45,10],[46,7,46,8],[45,0,45,1],[44,0,44,1],[43,0,43,1],[45,13,45,14],[43,13,43,14],[44,13,44,14],[18,13,18,14],[41,0,41,6],[40,0,40,8],[33,0,34,1],[33,4,34,4],[35,4,36,4],[35,3,36,3],[35,2,36,2],[38,0,38,4],[35,0,36,1],[37,13,37,14],[38,13,38,14],[36,13,36,14],[34,13,34,14],[35,13,35,14],[33,13,33,14],[29,0,30,4],[31,0,31,4],[33,2,34,2],[33,3,34,3]]}
["University of Louisville - Travel Expense Voucher"]
["Meals"]
[]
[null,null,null,null,"Employee/Student Name:",{"$f":"TitlePage!F6","v":0}]
[null,null,null,null,"Department:",{"$f":"TitlePage!Q6","v":0}]
[null,null,null,"Dates of Travel",null,"Departure Date:",{"$f":"TitlePage!G11","v":"00:00:00"},null,null,null,"Return Date:",{"$f":"TitlePage!Q11","v":"00:00:00"}]
[null,null,null,null,null,"Departure Time:",{"$f":"TitlePage!G12","v":"00:00:00"},null,null,null,"Return Time:",{"$f":"TitlePage!Q12","v":"00:00:00"},null,null,null,null,null,{"$f":"IF(C13=\"KY\",MEAL_IN,IF(LEN(TRIM(C13))>1,MEAL_OUT,\"\"))","v":""}]
["Meals - Use a separate line for each day."]
[null,null,null,null,"Maximum",null,"Breakfast","Lunch","Dinner",null,"ACCOUNT CODE"]
["DATE",null,"STATE","CITY","Daily Rate",null,"See Chart Below for Rates",null,null,null,"Select Code from List",null,null,"AMOUNT ",null,null,null,"InState","OutofState","International","Student","Nonemployee"]
[]
[null,null,null,null,{"$f":"IF(D12=\"\",\"\",LOOKUP(D12,perdiem!Q$3:S$517))","v":""},null,null,null,null,null,null,null,null,{"$f":"SUM(G12:I12)","v":0},null,null,null,{"$f":"IF($K12=\"535113 In-state Travel Misc. Expenses\",$N12,\" \")","v":" "},{"$f":"IF($K12=\"535213 Out-of-state Travel Misc. Expenses\",$N12,\" \")","v":" "},{"$f":"IF($K12=\"535313 International Travel Misc. Expenses\",$N12,\" \")","v":" "},{"$f":"IF($K12=\"535413 Student Travel Misc. Expenses\",$N12,\" \")","v":" "},{"$f":"IF($K12=\"535553 Other Non-Employee Travel Misc. Expenses\",$N12,\" \")","v":" "}]
[null,null,null,null,{"$f":"IF(D13=\"\",\"\",LOOKUP(D13,perdiem!Q$3:S$517))","v":""},null,null,null,null,null,null,null,null,{"$f":"SUM(G13:I13)","v":0},null,null,null,{"$f":"IF($K13=\"535113 In-state Travel Misc. Expenses\",$N13,\" \")","v":" "},{"$f":"IF($K13=\"535213 Out-of-state Travel Misc. Expenses\",$N13,\" \")","v":" "},{"$f":"IF($K13=\"535313 International Travel Misc. Expenses\",$N13,\" \")","v":" "},{"$f":"IF($K13=\"535413 Student Travel Misc. Expenses\",$N13,\" \")","v":" "},{"$f":"IF($K13=\"535553 Other Non-Employee Travel Misc. Expenses\",$N13,\" \")","v":" "}]
[null,null,null,null,{"$f":"IF(D14=\"\",\"\",LOOKUP(D14,perdiem!Q$3:S$517))","v":""},null,null,null,null,null,null,null,null,0,null,null,null," "," "," "," "," "]
[null,null,null,null,{"$f":"IF(D15=\"\",\"\",LOOKUP(D15,perdiem!Q$3:S$517))","v":""},null,null,null,null,null,null,null,null,0,null,null,null," "," "," "," "," "]
[null,null,null,null,{"$f":"IF(D16=\"\",\"\",LOOKUP(D16,perdiem!Q$3:S$517))","v":""},null,null,null,null,null,null,null,null,0,null,null,null," "," "," "," "," "]
[null,null,null,null,{"$f":"IF(D17=\"\",\"\",LOOKUP(D17,perdiem!Q$3:S$517))","v":""},null,null,null,null,null,null,null,null,0,null,null,null," "," "," "," "," "]
[null,null,null,null,{"$f":"IF(D18=\"\",\"\",LOOKUP(D18,perdiem!Q$3:S$517))","v":""},null,null,null,null,null,null,null,null,0,null,null,null," "," "," "," "," "]
[null,null,null,null,{"$f":"IF(D19=\"\",\"\",LOOKUP(D19,perdiem!Q$3:S$517))","v":""},null,null,null,null,null,null,null,null,0,null,null,null," "," "," "," "," "]
[null,null,null,null,{"$f":"IF(D20=\"\",\"\",LOOKUP(D20,perdiem!Q$3:S$517))","v":""},null,null,null,null,null,null,null,null,0,null,null,null," "," "," "," "," "]
{"$rows_left_out":497}
{"sheet":"Mileage","index":2,"n_rows":39,"n_cols":23,"rows_kept":39,"cut":false,"hidden":false,"merged":[[6,6,6,9],[6,11,6,13],[9,2,9,4],[9,9,9,10],[0,0,0,14],[1,0,1,14],[4,5,4,8],[4,9,4,12],[5,6,5,9],[5,11,5,13],[11,9,11,10],[12,2,12,4],[12,9,12,10],[13,2,13,4],[13,9,13,10],[11,2,11,4],[15,2,15,4],[15,9,15,10],[16,2,16,4],[16,9,16,10],[14,6,14,7],[15,6,15,7],[16,6,16,7],[14,2,14,4],[14,9,14,10],[17,9,17,10],[18,2,18,4],[18,9,18,10],[19,2,19,4],[19,9,19,10],[17,6,17,7],[18,6,18,7],[19,6,19,7],[20,9,20,10],[21,2,21,4],[21,9,21,10],[22,2,22,4],[22,9,22,10],[20,6,20,7],[21,6,21,7],[22,6,22,7],[26,2,26,4],[26,9,26,10],[26,6,26,7],[23,2,23,4],[23,9,23,10],[24,2,24,4],[24,9,24,10],[25,2,25,4],[25,9,25,10],[24,6,24,7],[50,13,50,14],[25,6,25,7],[41,13,41,14],[42,13,42,14],[44,13,44,14],[45,13,45,14],[40,8,40,9],[46,0,46,4],[46,13,46,14],[47,13,47,14],[48,13,48,14],[49,0,49,4],[55,0,55,4],[9,6,9,7],[8,6,8,7],[10,6,10,7],[11,6,11,7],[12,6,12,7],[13,6,13,7],[23,6,23,7],[20,2,20,4],[17,2,17,4],[51,0,52,1],[51,2,52,2],[51,3,52,3],[51,4,52,4],[53,0,53,1],[54,0,54,1]]}
["University of Louisville - Travel Expense Voucher"]
["Private Auto Mileage"]
[]
[null,null,null,null,"Employee/Student Name:",{"$f":"TitlePage!F6","v":0}]
[null,null,null,null,"Department:",{"$f":"TitlePage!Q6","v":0}]
[null,null,null,"Dates of Travel",null,"Departure Date:",{"$f":"TitlePage!G11","v":"00:00:00"},null,null,null,"Return Date:",{"$f":"TitlePage!Q11","v":"00:00:00"}]
[null,null,null,null,null,"Departure Time:",{"$f":"TitlePage!G12","v":"00:00:00"},null,null,null,"Return Time:",{"$f":"TitlePage!Q12","v":"00:00:00"}]
["Private Auto Miles - Use a separate line for each day."]
[null,null,null,null,null,null,"PRIVATE AUTO MILES",null,"IRS"]
["DATE",null,"ACCOUNT CODE (Select Code from List)",null,null,null,"Enter Mileage ",null,"Rate","AMOUNT ",null,null,null,null,null,null,null,"InState","OutofState","International","Student","Nonemployee"]
[]
[null,null,null,null,null,null,null,null,0.56000000000000005,{"$f":"ROUND((G12*I12),2)","v":0},null,null,null,null,null,null,null,{"$f":"IF($C12=\"535113 In-state Travel Misc. Expenses\",$J12,\" \")","v":" "},{"$f":"IF($C12=\"535213 Out-of-state Travel Misc. Expenses\",$J12,\" \")","v":" "},{"$f":"IF($C12=\"535313 International Travel Misc. Expenses\",$J12,\" \")","v":" "},{"$f":"IF($C12=\"535413 Student Travel Misc. Expenses\",$J12,\" \")","v":" "},{"$f":"IF($C12=\"535553 Other Non-Employee Travel Misc. Expenses\",$J12,\" \")","v":" "}]
[null,null,null,null,null,null,null,null,0.56000000000000005,{"$f":"ROUND((G13*I13),2)","v":0},null,null,null,null,null,null,null," "," "," "," "," "]
[null,null,null,null,null,null,null,null,0.56000000000000005,0,null,null,null,null,null,null,null," "," "," "," "," "]
[null,null,null,null,null,null,null,null,0.56000000000000005,0,null,null,null,null,null,null,null," "," "," "," "," "]
[null,null,null,null,null,null,null,null,0.56000000000000005,0,null,null,null,null,null,null,null," "," "," "," "," "]
[null,null,null,null,null,null,null,null,0.56000000000000005,0,null,null,null,null,null,null,null," "," "," "," "," "]
[null,null,null,null,null,null,null,null,0.56000000000000005,0,null,null,null,null,null,null,null," "," "," "," "," "]
[null,null,null,null,null,null,null,null,0.56000000000000005,0,null,null,null,null,null,null,null," "," "," "," "," "]
[null,null,null,null,null,null,null,null,0.56000000000000005,0,null,null,null,null,null,null,null," "," "," "," "," "]
{"$rows_left_out":20}
{"sheet":"Lodging","index":3,"n_rows":36,"n_cols":19,"rows_kept":36,"cut":false,"hidden":false,"merged":[[0,0,0,7],[31,5,31,7],[19,5,19,7],[20,5,20,7],[21,5,21,7],[22,5,22,7],[15,5,15,7],[16,5,16,7],[17,5,17,7],[14,5,14,7],[1,0,1,7],[12,5,12,7],[11,5,11,7],[4,5,4,6],[26,5,26,7],[18,5,18,7],[23,5,23,7],[24,5,24,7],[25,5,25,7],[33,5,33,7],[35,5,35,7],[27,5,27,7],[29,5,29,7],[30,5,30,7],[32,5,32,7]]}
["University of Louisville - Travel Expense Voucher"]
["Lodging Expenses"]
[]
[null,null,"Employee/Student Name:",{"$f":"TitlePage!F6","v":0}]
[null,null,"Department:",{"$f":"TitlePage!Q6","v":0}]
[]
[]
[]
[]
[]
[]
[null,null,"ACCOUNT CODE"]
["DATE",null,"(Select from List)","EXPLANATION (Optional)",null," Room and Room Taxes Only",null,null,null,null,null,null,"InState","OutofState","International","Student","Nonemployee"]
[]
[null,null,null,null,null,null,null,null,null,null,null,null,{"$f":"IF($C15=\"535111 In-state Travel Hotel\",$F15,\" \")","v":" "},{"$f":"IF($C15=\"535211 Out-of-state Travel Hotel\",$F15,\" \")","v":" "},{"$f":"IF($C15=\"535311 International Travel Hotel\",$F15,\" \")","v":" "},{"$f":"IF($C15=\"535411 Student Travel Hotel\",$F15,\" \")","v":" "},{"$f":"IF($C15=\"535551 Other Non-Employee Travel Hotel\",$F15,\" \")","v":" "}]
[null,null,null,null,null,null,null,null,null,null,null,null,{"$f":"IF($C16=\"535111 In-state Travel Hotel\",$F16,\" \")","v":" "},{"$f":"IF($C16=\"535211 Out-of-state Travel Hotel\",$F16,\" \")","v":" "},{"$f":"IF($C16=\"535311 International Travel Hotel\",$F16,\" \")","v":" "},{"$f":"IF($C16=\"535411 Student Travel Hotel\",$F16,\" \")","v":" "}," "]
[null,null,null,null,null,null,null,null,null,null,null,null," "," "," "," "," ",null,"IF(IN_OUT=\"IN\",CAR_IN,IF(IN_OUT=\"OUT\",CAR_OUT,CAR_ALL))"]
[null,null,null,null,null,null,null,null,null,null,null,null," "," "," "," "," "]
[null,null,null,null,null,null,null,null,null,null,null,null," "," "," "," "," "]
[null,null,null,null,null,null,null,null,null,null,null,null," "," "," "," "," "]
{"$rows_left_out":17}
{"sheet":"Misc.Expenses","index":4,"n_rows":53,"n_cols":21,"rows_kept":53,"cut":false,"hidden":false,"merged":[[33,7,33,9],[26,7,26,9],[28,7,28,9],[29,7,29,9],[30,7,30,9],[31,7,31,9],[27,7,27,9],[32,7,32,9],[38,4,38,5],[37,2,37,3],[38,2,38,3],[36,4,36,5],[35,4,35,5],[35,2,35,3],[36,2,36,3],[37,4,37,5],[40,7,40,9],[41,7,41,9],[34,7,34,9],[35,7,35,9],[36,7,36,9],[37,7,37,9],[38,7,38,9],[42,7,42,9],[43,7,43,9],[44,7,44,9],[47,7,47,9],[45,7,45,9],[16,7,16,9],[17,7,17,9],[18,7,18,9],[19,7,19,9],[31,4,31,5],[23,7,23,9],[25,7,25,9],[28,4,28,5],[29,4,29,5],[30,4,30,5],[27,4,27,5],[32,4,32,5],[33,4,33,5],[34,4,34,5],[34,2,34,3],[26,4,26,5],[30,2,30,3],[28,2,28,3],[27,2,27,3],[29,2,29,3],[31,2,31,3],[32,2,32,3],[33,2,33,3],[22,2,22,3],[23,2,23,3],[25,2,25,3],[26,2,26,3],[0,0,0,9],[1,0,1,9],[4,7,4,8],[23,4,23,5],[25,4,25,5],[13,2,13,3],[13,4,13,5],[8,7,8,9],[10,2,10,3],[10,4,10,5],[13,7,13,9],[14,2,14,3],[14,4,14,5],[14,7,14,9],[11,7,11,9],[12,2,12,3],[10,7,10,9],[12,4,12,5],[12,7,12,9],[11,2,11,3],[11,4,11,5],[3,3,3,5],[4,3,4,5],[7,2,7,3],[8,2,8,3],[8,4,8,5]]}
["University of Louisville - Travel Expense Voucher"]
["Registration, Submission Fees & Miscellaneous Expenses"]
[]
[null,null,"Employee/Student Name:",{"$f":"TitlePage!F6","v":0}]
[null,null,"Department:",{"$f":"TitlePage!Q6","v":0}]
[]
["Registration and Submission Fees"]
[null,null,"ACCOUNT CODE "]
["DATE",null,"(Select Code from List)",null,"EXPLANATION (Optional)",null,null,"AMOUNT",null,null,null,null,null,null,"Registration","Student Reg","Submission"]
[]
[null,null,null,null,null,null,null,null,null,null,null,null,null,null,{"$f":"IF($C11=\"552100 Registration\",$H11,\" \")","v":" "},{"$f":"IF($C11=\"552150 Student Registration\",$H11,\" \")","v":" "},{"$f":"IF($C11=\"552500 Submission Fees\",$H11,\" \")","v":" "}]
[null,null,null,null,null,null,null,null,null,null,null,null,null,null,{"$f":"IF($C12=\"552100 Registration\",$H12,\" \")","v":" "},{"$f":"IF($C12=\"552150 Student Registration\",$H12,\" \")","v":" "},{"$f":"IF($C12=\"552500 Submission Fees\",$H12,\" \")","v":" "}]
[null,null,null,null,null,null,null,null,null,null,null,null,null,null,{"$f":"IF($C13=\"552100 Registration\",$H13,\" \")","v":" "},{"$f":"IF($C13=\"552150 Student Registration\",$H13,\" \")","v":" "},{"$f":"IF($C13=\"552500 Submission Fees\",$H13,\" \")","v":" "}]
[null,null,null,null,null,null,null,null,null,null,null,null,null,null,{"$f":"IF($C14=\"552100 Registration\",$H14,\" \")","v":" "},{"$f":"IF($C14=\"552150 Student Registration\",$H14,\" \")","v":" "},{"$f":"IF($C14=\"552500 Submission Fees\",$H14,\" \")","v":" "}]
[null,null,null,null,null,null,null,null,null,null,null,null,null,null,{"$f":"IF($C15=\"552100 Registration\",$H15,\" \")","v":" "},{"$f":"IF($C15=\"552150 Student Registration\",$H15,\" \")","v":" "},{"$f":"IF($C15=\"552500 Submission Fees\",$H15,\" \")","v":" "}]
[]
[null,null,"552100 Registration",null,null,null,null,{"$f":"SUM(O11:O15)","v":0}]
[null,null,"552150 Student Registration",null,null,null,null,{"$f":"SUM(P11:P15)","v":0}]
[null,null,"552500 Submission Fees",null,null,null,null,{"$f":"SUM(Q11:Q15)","v":0}]
[null,null,null,null,null,"Grand Total",null,{"$f":"SUM(H17:H19)","v":0}]
{"$rows_left_out":34}
{"sheet":"Air&RentalCar","index":5,"n_rows":45,"n_cols":19,"rows_kept":45,"cut":false,"hidden":false,"merged":[[36,2,36,3],[31,2,31,3],[32,2,32,3],[33,2,33,3],[34,2,34,3],[35,2,35,3],[28,2,28,3],[29,2,29,3],[0,0,0,6],[11,2,11,3],[1,0,1,6],[2,0,2,6],[10,5,10,6],[8,2,8,3],[9,2,9,3],[16,2,16,3],[14,2,14,3],[12,2,12,3],[15,2,15,3],[13,2,13,3]]}
["University of Louisville - Travel Expense Voucher"]
["Air Fare and Rental Car Expenses"]
["(Use Only if Expenses Paid by Traveler)"]
[]
[null,null,"Employee/Student Name:",{"$f":"TitlePage!F6","v":0}]
[null,null,"Department:",{"$f":"TitlePage!Q6","v":0}]
[]
["Air Fare - List Only if Paid by Traveler"]
[null,null,"ACCOUNT CODE"]
["DATE",null," (Select Code from List)",null,"EXPLANATION (Optional)",null,"AMOUNT ",null,null,null,"InState","OutofState","International","Student","Nonemployee"]
[]
[null,null,null,null,null,null,null,null,null,null,{"$f":"IF($C12=\"535110 In-state Travel Air\",$G12,\" \")","v":" "},{"$f":"IF($C12=\"535210 Out-of-state Travel Air\",$G12,\" \")","v":" "},{"$f":"IF($C12=\"535310 International Travel Air\",$G12,\" \")","v":" "},{"$f":"IF($C12=\"535410 Student Travel Air\",$G12,\" \")","v":" "},{"$f":"IF($C12=\"535550 Other Non-Employee Travel Air\",$G12,\" \")","v":" "}]
[null,null,null,null,null,null,null,null,null,null," "," "," "," "," "]
[null,null,null,null,null,null,null,null,null,null," "," "," "," "," "]
[null,null,null,null,null,null,null,null,null,null," "," "," "," "," "]
[null,null,null,null,null,null,null,null,null,null," "," "," "," "," "]
[null,null,null,null,null,null,null,null,null,null," "," "," "," "," "]
[]
[null,null,"535110 In-state Travel Air",null,"Totals for Air Fare:",null,{"$f":"SUM(K12:K17)","v":0}]
[null,null,"535210 Out-of-state Travel Air",null,null,null,{"$f":"SUM(L12:L17)","v":0},null,null,null,null,null,null,null,null,null,null,null,"535110 In-state Travel Air"]
{"$rows_left_out":26}
{"sheet":"perdiem","index":6,"n_rows":517,"n_cols":19,"rows_kept":517,"cut":false,"hidden":true,"merged":[[3,0,4,0]]}
[null,null,null,null,null,null,null,"FY2013 Domestic Per Diem Rates ",null,null,null,null,"Location","Maximum Per Diem"]
["Schedule for daily Meal Per Diem Rates",null,null,null,null,"STATES",null,"State","Primary Destination","M&IE",null,null,"Marshall Islands"]
["Using 20/30/50 Percent ",null,null,null,null,"AL",null,null,"Standard CONUS Rate applies to all destinations or counties not specifically listed",null,null,null,"KWAJALEIN ATOLL",null,null,null,"Aberdeen / Bel Air / Belcamp",56,56]
["Maximum Per Day",null,null,null,null,"AK",null,"Alabama","Birmingham",null,null,null,"LIKIEP ATOLL",null,null,null,"Abingdon",46,46]
[null,"Breakfast","Lunch","Dinner",null,"AZ",null,"Alabama","Gulf Shores",null,null,null,"MAJURO",null,null,null,"ADAK",64,64]
[15,{"$f":"A6*0.2","v":3},{"$f":"A6*0.3","v":4.5},{"$f":"A6*0.5","v":7.5},null,"AR",null,"Alabama","Huntsville",null,null,null,null,null,null,null,"AGUADILLA",90,90]
[26,{"$f":"A7*0.2","v":5.2},{"$f":"A7*0.3","v":7.8},{"$f":"A7*0.5","v":13},null,"CA",null,"Alabama","Mobile",null,null,null,null,null,null,null,"Aiken",46,46]
[28,5.6000000000000005,8.4,14,null,"CO",null,"Alabama","Montgomery",null,null,null,"Guam",null,null,null,"Akron",51,51]
[30,6,9,15,null,"CT",null,null,"Other",null,null,null,null,null,null,null,"Albany",61,61]
[32,6.4,9.6,16,null,"DE",null,"Arizona","Grand Canyon / Flagstaff",null,null,null,"American Samoa",null,null,null,"Albuquerque",56,56]
[36,7.2,10.799999999999999,18,null,"DC",null,"Arizona","Kayenta",null,null,null,null,null,null,null,"Allentown / Easton / Bethlehem",51,51]
[39,7.8000000000000007,11.7,19.5,null,"FL",null,"Arizona","Phoenix / Scottsdale",null,null,null,"Midway Islands",null,null,null,"Altamonte Springs",61,61]
[41,8.2000000000000011,12.299999999999999,20.5,null,"GA",null,"Arizona","Sedona",null,null,null,null,null,null,null,"American Samoa",60,60]
[42,8.4,12.6,21,null,"HI",null,"Arizona","Sierra Vista",null,null,null,"Northern Mariana Islands",null,null,null,"Anacortes / Coupeville / Oak Harbor",61,61]
[44,8.8000000000000007,13.2,22,null,"ID",null,"Arizona","Tucson",null,null,null,"ROTA",null,null,null,"ANCHORAGE [INCL NAV RES]",71,71]
[46,9.2000000000000011,13.799999999999999,23,null,"IL",null,"Arizona","Yuma",null,null,null,"SAIPAN",null,null,null,"Andover",56,56]
[49,9.8000000000000007,14.7,24.5,null,"IN",null,null,"Other",null,null,null,"TINIAN",null,null,null,"Ann Arbor",56,56]
[50,10,15,25,null,"IA",null,"Arkansas","Hot Springs",null,null,null,null,null,null,null,"Annapolis",61,61]
[51,10.200000000000001,15.299999999999999,25.5,null,"KS",null,"Arkansas","Little Rock",null,null,null,null,null,null,null,"Antioch / Brentwood / Concord",66,66]
[54,10.8,16.2,27,null,"KY",null,null,"Other",null,null,null,"Virgin Islands (US)",null,null,null,"Appleton",46,46]
{"$rows_left_out":497}